CFD Online Logo CFD Online URL
www.cfd-online.com
[Sponsors]
Home > Forums > OpenFOAM Bugs

Compilation fails on suse linux 101

Register Blogs Members List Search Today's Posts Mark Forums Read

Reply
 
LinkBack Thread Tools Display Modes
Old   July 20, 2007, 04:34
Default Dear everyone I am new to o
  #1
Senior Member
 
su_junwei's Avatar
 
su junwei
Join Date: Mar 2009
Location: Xi'an China
Posts: 151
Rep Power: 10
su_junwei is on a distinguished road
Send a message via MSN to su_junwei
Dear everyone

I am new to openfoam. I download the openfoam 1.4 and tried to compiled on suse linux 10.1 after fixed it according to the contents on the site
http://www.cfd-online.com/OpenFOAM_D...tml?1182157148
but the following errors arised during the compilation

-lmeshTools /home/sujunwei/OpenFOAM/OpenFOAM-1.4/applications/utilities/mes
h/manipulation/setSet/readline-5.0/platforms/linuxGcc4DPOpt/lib/libreadline.a -L
/usr/lib/termcap -L/usr/lib64/termcap -ltermcap -lOpenFOAM -liberty -ldl -lm -
o /home/sujunwei/OpenFOAM/OpenFOAM-1.4/applications/bin/linuxGcc4DPOpt/setSet
/usr/bin/ld: cannot find -ltermcap
collect2: ld returned 1 exit status
make[3]: *** [/home/sujunwei/OpenFOAM/OpenFOAM-1.4/applications/bin/linuxGcc4DPO
pt/setSet] error 1
make[3]: Leaving directory `/home/sujunwei/OpenFOAM/OpenFOAM-1.4/applications/ut
ilities/mesh/manipulation/setSet/setSet'
make[2]: *** [setSet] error 2
make[2]: Leaving directory `/home/sujunwei/OpenFOAM/OpenFOAM-1.4/applications/ut
ilities/mesh/manipulation'
make[1]: *** [manipulation] error 2
make[1]: Leaving directory `/home/sujunwei/OpenFOAM/OpenFOAM-1.4/applications/ut
ilities/mesh'
make: *** [mesh] error 2

would you give me some suggestion?

Thanks
su_junwei is offline   Reply With Quote

Old   July 20, 2007, 04:42
Default Install the termcap package fr
  #2
Senior Member
 
Srinath Madhavan (a.k.a pUl|)
Join Date: Mar 2009
Location: Edmonton, AB, Canada
Posts: 698
Rep Power: 12
msrinath80 is on a distinguished road
Install the termcap package from an RPM. Go here[1] and choose your platform accordingly and download the relevant RPM file. If there is a termcap-devel package, install it as well. You can install (as root) using the following command 'rpm -Uvh package_name_goes_here.rpm'

[1] http://download.opensuse.org/distrib...t-source/suse/

NB: The correct thread for this post is on the OpenFOAM -> Installation section.
msrinath80 is offline   Reply With Quote

Old   July 20, 2007, 04:56
Default ok Srinath, Thanks now, it w
  #3
Senior Member
 
su_junwei's Avatar
 
su junwei
Join Date: Mar 2009
Location: Xi'an China
Posts: 151
Rep Power: 10
su_junwei is on a distinguished road
Send a message via MSN to su_junwei
ok Srinath, Thanks
now, it works well
su_junwei is offline   Reply With Quote

Reply

Thread Tools
Display Modes

Posting Rules
You may not post new threads
You may not post replies
You may not post attachments
You may not edit your posts

BB code is On
Smilies are On
[IMG] code is On
HTML code is Off
Trackbacks are On
Pingbacks are On
Refbacks are On


Similar Threads
Thread Thread Starter Forum Replies Last Post
OpenFOAM on SuSE Linux 100 musahossein OpenFOAM Installation 4 June 20, 2008 16:47
OpenFOAM compilation fails on applicationsutilitiesmesh geoffjay OpenFOAM Installation 12 April 29, 2008 15:26
Compilation fails on Linuxx86 agrahn OpenFOAM Bugs 21 August 31, 2007 04:10
OF 14 Compilation error SuSE 102 64bit alberto OpenFOAM Installation 5 May 15, 2007 03:27
CFX and SUSE linux Paul CFX 5 December 23, 2004 22:53


All times are GMT -4. The time now is 11:01.