CFD Online URL
[Sponsors]
Home > Forums > OpenFOAM Installation on Windows, Mac and other Unsupported Platforms

fatal error compiling OF-2.2.2 on Mac

Register Blogs Members List Search Today's Posts Mark Forums Read

Reply
 
LinkBack Thread Tools Display Modes
Old   July 29, 2014, 13:51
Default fatal error compiling OF-2.2.2 on Mac
  #1
New Member
 
Join Date: Jul 2014
Posts: 1
Rep Power: 0
camel_85 is on a distinguished road
Hello all,

i've tried to install OpenFOAM-2.2.2 on my MAC like it is explained in http://openfoamwiki.net/index.php/In...tion_and_Notes. I get some errors while compiling. The first errors are

UPstream.C:26:17: fatal error: mpi.h: No such file or directory
compilation terminated.
UOPwrite.C:29:17: fatal error: mpi.h: No such file or directory
compilation terminated.
make: *** [Make/darwinIntel64Gcc46DPOptSYSTEMOPENMPI/UPstream.o] Error 1
make: *** Waiting for unfinished jobs....
make: *** [Make/darwinIntel64Gcc46DPOptSYSTEMOPENMPI/UOPwrite.o] Error 1
UIPread.C:29:17: fatal error: mpi.h: No such file or directory
compilation terminated.
In file included from PstreamGlobals.C:26:0:
PstreamGlobals.H:39:17: fatal error: mpi.h: No such file or directory
compilation terminated.
make: *** [Make/darwinIntel64Gcc46DPOptSYSTEMOPENMPI/PstreamGlobals.o] Error 1
make: *** [Make/darwinIntel64Gcc46DPOptSYSTEMOPENMPI/UIPread.o] Error 1
+ OSspecific/POSIX/Allwmake

Can anyone please help me? Thanks a lot!
camel_85 is offline   Reply With Quote

Reply

Thread Tools
Display Modes

Posting Rules
You may not post new threads
You may not post replies
You may not post attachments
You may not edit your posts

BB code is On
Smilies are On
[IMG] code is On
HTML code is Off
Trackbacks are On
Pingbacks are On
Refbacks are On


Similar Threads
Thread Thread Starter Forum Replies Last Post
Mac OS X Mavericks OpenFOAM 2.2.2 Installation Error Ingöö OpenFOAM Installation on Windows, Mac and other Unsupported Platforms 2 July 24, 2014 08:06
sHM: FATAL ERROR: More than six unsigned transforms detected Djub OpenFOAM Native Meshers: snappyHexMesh and Others 0 July 15, 2014 05:43
Error in installing OpenFoam 2.2.2 in Mac Mavericks YGNITO1986 OpenFOAM Installation on Windows, Mac and other Unsupported Platforms 0 April 8, 2014 10:41
simpleFoam parallel AndrewMortimer OpenFOAM Running, Solving & CFD 10 November 12, 2013 18:03
error while compiling the USER Sub routine CFD user CFX 3 November 25, 2002 16:16


All times are GMT -4. The time now is 18:06.