CFD Online Logo CFD Online URL
www.cfd-online.com
[Sponsors]
Home > Forums > OpenFOAM Installation

Error compiling paraView-3.12.0 on fc13

Register Blogs Members List Search Today's Posts Mark Forums Read

Reply
 
LinkBack Thread Tools Display Modes
Old   April 23, 2012, 03:39
Default Error compiling paraView-3.12.0 on fc13
  #1
jsf
New Member
 
John Faragher
Join Date: Feb 2011
Posts: 2
Rep Power: 0
jsf is on a distinguished road
I am trying to compile paraView-3.12.0 on fc13.

I have compiled OpenFOAM-2.1.x successfully.
I got it using GIT
$ git clone http://github.com/OpenFOAM/OpenFOAM-2.1.x.git

I downloaded from http://www.openfoam.org/download/source.php
ThirdParty-2.1.0.tgz

fc13, it has cmake.x86_64 0:2.8.0-3.fc13 and qt.x86_64 1:4.6.3-10.fc13

I have tried with and without MPI and Python

I keep getting "File truncated" errors like this:

[ 42%] Building CXX object VTK/Graphics/CMakeFiles/vtkGraphicsPythonD.dir/vtkGraphicsPythonInit.cxx.o
Linking CXX shared library ../../bin/libvtkGraphicsPythonD.so
CMakeFiles/vtkGraphicsPythonD.dir/vtkAnnotationLinkPython.cxx.o: file not recognized: File truncated
collect2: ld returned 1 exit status
make[2]: *** [bin/libvtkGraphicsPythonD.so.pv3.12] Error 1
make[1]: *** [VTK/Graphics/CMakeFiles/vtkGraphicsPythonD.dir/all] Error 2
make: *** [all] Error 2

I have tried deleting everything and starting again a few times.

Any help would be appreciated. Thanks in advance!
Attached Files
File Type: gz log-makeParaview-noMPI-3.txt.tar.gz (38.0 KB, 2 views)
jsf is offline   Reply With Quote

Old   April 23, 2012, 05:08
Default
  #2
Super Moderator
 
Bruno Santos
Join Date: Mar 2009
Location: Lisbon, Portugal
Posts: 8,318
Blog Entries: 34
Rep Power: 84
wyldckat is just really nicewyldckat is just really nicewyldckat is just really nicewyldckat is just really nice
Greetings John and welcome to the forum!

Assuming you have enough disk space, then the problem might be related to the outdated CMake. I think the minimum CMake is 2.8.3 for ParaView 3.12.0, although the installer doesn't complain about it.

The following post was tested on Ubuntu 10.04, but it should work on Fedora 13 as well: paraview compilation error paraview-3.12.0 - post #9

Best regards,
Bruno
wyldckat is offline   Reply With Quote

Old   April 24, 2012, 00:26
Default
  #3
jsf
New Member
 
John Faragher
Join Date: Feb 2011
Posts: 2
Rep Power: 0
jsf is on a distinguished road
Hi Bruno,

Thanks very much for your suggestion. I followed those instructions and upgraded cmake but I got exactly the same error.

Is the a "clean" command I should have used before trying to compile again?

It now seems that my RAID array is failing and may need to be rebuilt so that may be causing the problem. I will probably try to install to Fedora-16 after rebuilding the RAID array. Then I will install OpenFOAM on that.

Thanks again for your help.

Cheers,
John
jsf is offline   Reply With Quote

Reply

Tags
compile error, paraview 3.12

Thread Tools
Display Modes

Posting Rules
You may not post new threads
You may not post replies
You may not post attachments
You may not edit your posts

BB code is On
Smilies are On
[IMG] code is On
HTML code is Off
Trackbacks are On
Pingbacks are On
Refbacks are On


Similar Threads
Thread Thread Starter Forum Replies Last Post
[Critical] ParaView 3.12.0 breaks monitor signal in Ubuntu 11.04 v_mil OpenFOAM Paraview & paraFoam 5 March 18, 2012 14:39
Compiling Paraview 3.12.0 and the PV3FoamReader Module smpark OpenFOAM Installation 2 January 9, 2012 08:16
Newbie: Install ParaView 3.81 on OF-1.6-ext/OpenSuse 11.2? lentschi OpenFOAM Installation 1 March 9, 2011 03:32
Paraview not found fusij OpenFOAM Installation 2 January 1, 2011 21:44
paraFoam reader for OpenFOAM 1.6 smart OpenFOAM Installation 13 November 16, 2009 22:41


All times are GMT -4. The time now is 06:58.