CFD Online Logo CFD Online URL
www.cfd-online.com
[Sponsors]
Home > Forums > OpenFOAM Installation

cbrtf not declared

Register Blogs Members List Search Today's Posts Mark Forums Read

Reply
 
LinkBack Thread Tools Display Modes
Old   April 3, 2008, 11:25
Default Hello Foamers: I met a stra
  #1
Senior Member
 
lakeat's Avatar
 
Daniel WEI (老魏)
Join Date: Mar 2009
Location: South Bend, IN, USA
Posts: 688
Blog Entries: 9
Rep Power: 12
lakeat is on a distinguished road
Send a message via Skype™ to lakeat
Hello Foamers:

I met a strange problem when I compile OpenFOAM-1.4.1-dev on IRIX, ::cbrtf not declared, seems transFunc doesn't work as it should do.

--------------------------
onyx-bridge 21% ./Allwmake
+ cd wmake
+ ./makeWmake
make: Nothing to be done for `all'.
+ cd src
+ ./Allwmake
+ cd /disk4/usr/people/student3/OpenFOAM/OpenFOAM-1.4.1-dev/src/OpenFOAM
+ wmakeLnInclude .
+ wmake libso zlib-1.2.1
`/disk4/usr/people/student3/OpenFOAM/OpenFOAM-1.4.1-dev/lib/sgiN32GccDPDebug/lib z.so' is up to date.
+ [ MPI = OPENMPI -a ! -r /lib/libmpi.a -a ! -r /lib/libmpi.so -a ! -r /lib/libmpi.dylib ]
+ [ MPI = LAM -a ! -r /lib/libmpi.a -a ! -r /lib/libmpi.so -a ! -r /lib/libmpi.dylib ]
+ [ MPI = MPICH -a ! -r /lib/libmpich.a -a ! -r /lib/libmpich.so -a ! -r /lib/libmpich.dylib ]
+ cd /disk4/usr/people/student3/OpenFOAM/OpenFOAM-1.4.1-dev/applications/utilities/mi scellaneous
+ wmake exe foamFlex
`/disk4/usr/people/student3/OpenFOAM/OpenFOAM-1.4.1-dev/applications/bin/sgiN32G ccDPDebug/foamFlex++' is up to date.
+ cp foamFlex/FlexLexer.h /disk4/usr/people/student3/OpenFOAM/OpenFOAM-1.4.1-dev/src/OpenFOAM/lnInclude
+ cd /disk4/usr/people/student3/OpenFOAM/OpenFOAM-1.4.1-dev/src
+ cd Pstream
+ ./Allwmake
+ wmake libso dummy
Making dependency list for source file OPwrite.C
Making dependency list for source file IPread.C
Making dependency list for source file Pstream.C
SOURCE=Pstream.C ; g++ -mabi=n32 -mips4 -DsgiN32 -DDP -Wall -W -Wno-unused-parameter -O0 -fdefault-inline -finline-functions -ggdb3 -DFULLDEBUG -DNoRepository -ftemplate-depth-30 -IlnInclude -I. -I/disk4/usr/people/student3/OpenFOAM/OpenFOAM-1.4.1-dev/src/OpenFOAM/lnInclude -fPIC -c $SOURCE -o Make/sgiN32GccDPDebug/Pstream.o
SOURCE=IPread.C ; g++ -mabi=n32 -mips4 -DsgiN32 -DDP -Wall -W -Wno-unused-parameter -O0 -fdefault-inline -finline-functions -ggdb3 -DFULLDEBUG -DNoRepository -ftemplate-depth-30 -IlnInclude -I. -I/disk4/usr/people/student3/OpenFOAM/OpenFOAM-1.4.1-dev/src/OpenFOAM/lnInclude -fPIC -c $SOURCE -o Make/sgiN32GccDPDebug/IPread.o
In file included from /disk4/usr/people/student3/OpenFOAM/OpenFOAM-1.4.1-dev/src/OpenFOAM/lnInclude/fl oatScalar.H:77,
from /disk4/usr/people/student3/OpenFOAM/OpenFOAM-1.4.1-dev/src/OpenFOAM/lnInclude/sc alar.H:40,
from /disk4/usr/people/student3/OpenFOAM/OpenFOAM-1.4.1-dev/src/OpenFOAM/lnInclude/IO stream.H:50,
from /disk4/usr/people/student3/OpenFOAM/OpenFOAM-1.4.1-dev/src/OpenFOAM/lnInclude/Os tream.H:42,
from /disk4/usr/people/student3/OpenFOAM/OpenFOAM-1.4.1-dev/src/OpenFOAM/lnInclude/OS stream.H:40,
from /disk4/usr/people/student3/OpenFOAM/OpenFOAM-1.4.1-dev/src/OpenFOAM/lnInclude/me ssageStream.H:211,
from /disk4/usr/people/student3/OpenFOAM/OpenFOAM-1.4.1-dev/src/OpenFOAM/lnInclude/er ror.H:48,
from /disk4/usr/people/student3/OpenFOAM/OpenFOAM-1.4.1-dev/src/OpenFOAM/lnInclude/UL istI.H:27,
from /disk4/usr/people/student3/OpenFOAM/OpenFOAM-1.4.1-dev/src/OpenFOAM/lnInclude/UL ist.H:298,
from /disk4/usr/people/student3/OpenFOAM/OpenFOAM-1.4.1-dev/src/OpenFOAM/lnInclude/Li st.H:43,
from /disk4/usr/people/student3/OpenFOAM/OpenFOAM-1.4.1-dev/src/OpenFOAM/lnInclude/la belList.H:37,
from /disk4/usr/people/student3/OpenFOAM/OpenFOAM-1.4.1-dev/src/OpenFOAM/lnInclude/Ps tream.H:45,
from Pstream.C:32:
/disk4/usr/people/student3/OpenFOAM/OpenFOAM-1.4.1-dev/src/OpenFOAM/lnInclude/Sc alar.H: In function 'Foam::floatScalar Foam::cbrt(Foam::floatScalar)':
/disk4/usr/people/student3/OpenFOAM/OpenFOAM-1.4.1-dev/src/OpenFOAM/lnInclude/Sc alar.H:196: error: '::cbrtf' has not been declared
/disk4/usr/people/student3/OpenFOAM/OpenFOAM-1.4.1-dev/src/OpenFOAM/lnInclude/Sc alar.H: In function 'Foam::floatScalar Foam::asinh(Foam::floatScalar)':
/disk4/usr/people/student3/OpenFOAM/OpenFOAM-1.4.1-dev/src/OpenFOAM/lnInclude/Sc alar.H:209: error: '::asinhf' has not been declared
/disk4/usr/people/student3/OpenFOAM/OpenFOAM-1.4.1-dev/src/OpenFOAM/lnInclude/Sc alar.H: In function 'Foam::floatScalar Foam::acosh(Foam::floatScalar)':
/disk4/usr/people/student3/OpenFOAM/OpenFOAM-1.4.1-dev/src/OpenFOAM/lnInclude/Sc alar.H:210: error: '::acoshf' has not been declared
/disk4/usr/people/student3/OpenFOAM/OpenFOAM-1.4.1-dev/src/OpenFOAM/lnInclude/Sc alar.H: In function 'Foam::floatScalar Foam::atanh(Foam::floatScalar)':
/disk4/usr/people/student3/OpenFOAM/OpenFOAM-1.4.1-dev/src/OpenFOAM/lnInclude/Sc alar.H:211: error: '::atanhf' has not been declared
/disk4/usr/people/student3/OpenFOAM/OpenFOAM-1.4.1-dev/src/OpenFOAM/lnInclude/Sc alar.H: In function 'Foam::floatScalar Foam::erf(Foam::floatScalar)':
/disk4/usr/people/student3/OpenFOAM/OpenFOAM-1.4.1-dev/src/OpenFOAM/lnInclude/Sc alar.H:215: error: '::erff' has not been declared
/disk4/usr/people/student3/OpenFOAM/OpenFOAM-1.4.1-dev/src/OpenFOAM/lnInclude/Sc alar.H: In function 'Foam::floatScalar Foam::erfc(Foam::floatScalar)':
/disk4/usr/people/student3/OpenFOAM/OpenFOAM-1.4.1-dev/src/OpenFOAM/lnInclude/Sc alar.H:216: error: '::erfcf' has not been declared
/disk4/usr/people/student3/OpenFOAM/OpenFOAM-1.4.1-dev/src/OpenFOAM/lnInclude/Sc alar.H: In function 'Foam::floatScalar Foam::lgamma(Foam::floatScalar)':
/disk4/usr/people/student3/OpenFOAM/OpenFOAM-1.4.1-dev/src/OpenFOAM/lnInclude/Sc alar.H:217: error: '::lgammaf' has not been declared
In file included from /disk4/usr/people/student3/OpenFOAM/OpenFOAM-1.4.1-dev/src/OpenFOAM/lnInclude/fl oatScalar.H:77,
from /disk4/usr/people/student3/OpenFOAM/OpenFOAM-1.4.1-dev/src/OpenFOAM/lnInclude/sc alar.H:40,
from /disk4/usr/people/student3/OpenFOAM/OpenFOAM-1.4.1-dev/src/OpenFOAM/lnInclude/IO stream.H:50,
from /disk4/usr/people/student3/OpenFOAM/OpenFOAM-1.4.1-dev/src/OpenFOAM/lnInclude/Os tream.H:42,
from /disk4/usr/people/student3/OpenFOAM/OpenFOAM-1.4.1-dev/src/OpenFOAM/lnInclude/OS stream.H:40,
from /disk4/usr/people/student3/OpenFOAM/OpenFOAM-1.4.1-dev/src/OpenFOAM/lnInclude/me ssageStream.H:211,
from /disk4/usr/people/student3/OpenFOAM/OpenFOAM-1.4.1-dev/src/OpenFOAM/lnInclude/er ror.H:48,
from IPread.C:30:
/disk4/usr/people/student3/OpenFOAM/OpenFOAM-1.4.1-dev/src/OpenFOAM/lnInclude/Sc alar.H: In function 'Foam::floatScalar Foam::cbrt(Foam::floatScalar)':
/disk4/usr/people/student3/OpenFOAM/OpenFOAM-1.4.1-dev/src/OpenFOAM/lnInclude/Sc alar.H:196: error: '::cbrtf' has not been declared
/disk4/usr/people/student3/OpenFOAM/OpenFOAM-1.4.1-dev/src/OpenFOAM/lnInclude/Sc alar.H: In function 'Foam::floatScalar Foam::asinh(Foam::floatScalar)':
/disk4/usr/people/student3/OpenFOAM/OpenFOAM-1.4.1-dev/src/OpenFOAM/lnInclude/Sc alar.H:209: error: '::asinhf' has not been declared
/disk4/usr/people/student3/OpenFOAM/OpenFOAM-1.4.1-dev/src/OpenFOAM/lnInclude/Sc alar.H: In function 'Foam::floatScalar Foam::acosh(Foam::floatScalar)':
/disk4/usr/people/student3/OpenFOAM/OpenFOAM-1.4.1-dev/src/OpenFOAM/lnInclude/Sc alar.H:210: error: '::acoshf' has not been declared
/disk4/usr/people/student3/OpenFOAM/OpenFOAM-1.4.1-dev/src/OpenFOAM/lnInclude/Sc alar.H: In function 'Foam::floatScalar Foam::atanh(Foam::floatScalar)':
/disk4/usr/people/student3/OpenFOAM/OpenFOAM-1.4.1-dev/src/OpenFOAM/lnInclude/Sc alar.H:211: error: '::atanhf' has not been declared
/disk4/usr/people/student3/OpenFOAM/OpenFOAM-1.4.1-dev/src/OpenFOAM/lnInclude/Sc alar.H: In function 'Foam::floatScalar Foam::erf(Foam::floatScalar)':
/disk4/usr/people/student3/OpenFOAM/OpenFOAM-1.4.1-dev/src/OpenFOAM/lnInclude/Sc alar.H:215: error: '::erff' has not been declared
/disk4/usr/people/student3/OpenFOAM/OpenFOAM-1.4.1-dev/src/OpenFOAM/lnInclude/Sc alar.H: In function 'Foam::floatScalar Foam::erfc(Foam::floatScalar)':
/disk4/usr/people/student3/OpenFOAM/OpenFOAM-1.4.1-dev/src/OpenFOAM/lnInclude/Sc alar.H:216: error: '::erfcf' has not been declared
/disk4/usr/people/student3/OpenFOAM/OpenFOAM-1.4.1-dev/src/OpenFOAM/lnInclude/Sc alar.H: In function 'Foam::floatScalar Foam::lgamma(Foam::floatScalar)':
/disk4/usr/people/student3/OpenFOAM/OpenFOAM-1.4.1-dev/src/OpenFOAM/lnInclude/Sc alar.H:217: error: '::lgammaf' has not been declared
make: *** [Make/sgiN32GccDPDebug/IPread.o] Error 1
make: *** Waiting for unfinished jobs....
make: *** [Make/sgiN32GccDPDebug/Pstream.o] Error 1
+ [ MPI = LAM -o MPI = OPENMPI -o MPI = MPI -o MPI = MPICH -o MPI = MPICH-GM -o MPI = MPIGAMMA ]
+ export WM_OPTIONS=sgiN32GccDPDebugMPI
----------------------------------


Please help, thanks!


Regards,
Daniel
__________________
~
Daniel WEI
-------------
NatHaz Modeling Laboratory
Department of Civil & Environmental Engineering & Earth Sciences
University of Notre Dame, USA
Email || My Personal CFD Blog
lakeat is offline   Reply With Quote

Reply

Thread Tools
Display Modes

Posting Rules
You may not post new threads
You may not post replies
You may not post attachments
You may not edit your posts

BB code is On
Smilies are On
[IMG] code is On
HTML code is Off
Trackbacks are On
Pingbacks are On
Refbacks are On


Similar Threads
Thread Thread Starter Forum Replies Last Post
OF14 compilation error bistreamb is already declared in this scope rafal OpenFOAM Installation 5 August 26, 2008 11:23


All times are GMT -4. The time now is 03:17.