CFD Online Logo CFD Online URL
www.cfd-online.com
[Sponsors]
Home > Forums > OpenFOAM Installation

Compilation error OF1.5-dev

Register Blogs Members List Search Today's Posts Mark Forums Read

Reply
 
LinkBack Thread Tools Display Modes
Old   April 16, 2009, 15:16
Default Compilation error OF1.5-dev
  #1
Member
 
Niklas Winkler
Join Date: Mar 2009
Location: Stockholm, Stockholm, Sweden
Posts: 73
Rep Power: 8
nikwin is on a distinguished road
When trying to build OF1.5-dev using ./Allwmake I get the following errors

vtkPV3FoamConvertMesh.C: In member function ‘void Foam::vtkPV3Foam::convertMeshCellZones(vtkMultiBlo ckDataSet*)’:
vtkPV3FoamConvertMesh.C:236: error: no matching function for call to ‘Foam::fvMeshSubset::fvMeshSubset(const Foam::fvMesh&)’
/scratch/nwinkler/ProgramFiles/OF-1.5/OpenFOAM-1.5-dev/src/finiteVolume/lnInclude/fvMeshSubset.H:287: note: candidates are: Foam::fvMeshSubset::fvMeshSubset(const Foam::IOobject&, const Foam::fvMesh&)
/scratch/nwinkler/ProgramFiles/OF-1.5/OpenFOAM-1.5-dev/src/finiteVolume/lnInclude/fvMeshSubset.H:244: note: Foam::fvMeshSubset::fvMeshSubset(const Foam::fvMeshSubset&)
vtkPV3FoamConvertMesh.C: In member function ‘void Foam::vtkPV3Foam::convertMeshCellSet(vtkMultiBlock DataSet*)’:
vtkPV3FoamConvertMesh.C:310: error: no matching function for call to ‘Foam::fvMeshSubset::fvMeshSubset(const Foam::fvMesh&)’
/scratch/nwinkler/ProgramFiles/OF-1.5/OpenFOAM-1.5-dev/src/finiteVolume/lnInclude/fvMeshSubset.H:287: note: candidates are: Foam::fvMeshSubset::fvMeshSubset(const Foam::IOobject&, const Foam::fvMesh&)
/scratch/nwinkler/ProgramFiles/OF-1.5/OpenFOAM-1.5-dev/src/finiteVolume/lnInclude/fvMeshSubset.H:244: note: Foam::fvMeshSubset::fvMeshSubset(const Foam::fvMeshSubset&)
make[3]: *** [Make/linux64GccDPOpt/vtkPV3FoamConvertMesh.o] Error 1

Some missing file or something else?
nikwin is offline   Reply With Quote

Old   April 17, 2009, 03:13
Default
  #2
Senior Member
 
dmoroian's Avatar
 
Dragos
Join Date: Mar 2009
Posts: 647
Rep Power: 11
dmoroian is on a distinguished road
Quote:
Originally Posted by nikwin View Post
...
/scratch/nwinkler/ProgramFiles/OF-1.5/OpenFOAM-1.5-dev/src/finiteVolume/lnInclude/fvMeshSubset.H:287
...
Maybe you mixed sources from 1.5 and 1.5-dev...?

Dragos
dmoroian is offline   Reply With Quote

Reply

Thread Tools
Display Modes

Posting Rules
You may not post new threads
You may not post replies
You may not post attachments
You may not edit your posts

BB code is On
Smilies are On
[IMG] code is On
HTML code is Off
Trackbacks are On
Pingbacks are On
Refbacks are On


Similar Threads
Thread Thread Starter Forum Replies Last Post
Compilation Error when running Tutorial 2.4 zhihuali CD-adapco 7 April 1, 2008 07:34
Gambit -dev X11 doesn't work Ervin Amet FLUENT 0 October 28, 2007 09:33
Compilation error with uparm.f Raghu CD-adapco 2 May 30, 2007 02:09
Compilation Error.... Arnab CD-adapco 4 September 12, 2004 15:54
Need help on double precision compilation tingguang Main CFD Forum 1 March 18, 2002 18:26


All times are GMT -4. The time now is 03:01.