CFD Online Logo CFD Online URL
www.cfd-online.com
[Sponsors]
Home > Forums > OpenFOAM

installing funkySetFields

Register Blogs Members List Search Today's Posts Mark Forums Read

Reply
 
LinkBack Thread Tools Display Modes
Old   November 15, 2012, 04:04
Default installing funkySetFields
  #1
igo
New Member
 
federico ghirelli
Join Date: Mar 2009
Posts: 4
Rep Power: 0
igo is on a distinguished road
Hi everybody,
I'm trying to install funkySetFields but it's not working and I cannot figure out why. I don't install swak4foam because my version of bison is 2.3 which is not sufficient for swak and I cannot upgrade to a newer version. Anyway, the error message that I am getting follows. Any help would be greatly appreciated.
Igo

./Allwmake
+ wmake funkySetFields
make: Warning: File `Make/linux64GccDPOpt/dontIncludeDeps' has modification time 3.2 s in the future
make: warning: Clock skew detected. Your build may be incomplete.
SOURCE=ValueExpressionParser.C ; g++ -m64 -Dlinux64 -DWM_DP -Wall -Wno-strict-aliasing -Wextra -Wno-unused-parameter -Wold-style-cast -Wnon-virtual-dtor -O3 -DNoRepository -ftemplate-depth-40 -IMake/linux64GccDPOpt -I/usrfem/femsys_local/OpenFOAM/OpenFOAM-1.6/src/finiteVolume/lnInclude -I/usrfem/femsys_local/OpenFOAM/OpenFOAM-1.6/src/meshTools/lnInclude -IlnInclude -I. -I/usrfem/femsys_local/OpenFOAM/OpenFOAM-1.6/src/OpenFOAM/lnInclude -I/usrfem/femsys_local/OpenFOAM/OpenFOAM-1.6/src/OSspecific/POSIX/lnInclude -fPIC -c $SOURCE -o Make/linux64GccDPOpt/ValueExpressionParser.o
ValueExpressionParser.tab.cc:68:40: error: ValueExpressionParser.tab.hh: No such file or directory
In file included from ValueExpressionParser.yy:62:
ValueExpressionDriver.H:25: error: incomplete type ‘ve::ValueExpressionParser’ used in nested name specifier
ValueExpressionDriver.H:25: error: ‘yylval’ was not declared in this scope
ValueExpressionDriver.H:25: error: expected primary-expression before ‘*’ token
ValueExpressionDriver.H:25: error: ‘yylloc’ was not declared in this scope
ValueExpressionDriver.H:25: error: expected primary-expression before ‘&’ token
ValueExpressionDriver.H:25: error: ‘driver’ was not declared in this scope
ValueExpressionDriver.H:25: error: initializer expression list treated as compound expression
ValueExpressionParser.tab.cc:195: error: invalid use of incomplete type ‘struct ve::ValueExpressionParser’
ValueExpressionDriver.H:18: error: forward declaration of ‘struct ve::ValueExpressionParser’
ValueExpressionParser.tab.cc:205: error: invalid use of incomplete type ‘struct ve::ValueExpressionParser’
ValueExpressionDriver.H:18: error: forward declaration of ‘struct ve::ValueExpressionParser’
ValueExpressionParser.tab.cc:385: error: ‘semantic_type’ has not been declared
ValueExpressionParser.tab.cc:386: error: ‘location_type’ has not been declared
ValueExpressionParser.tab.cc:386: error: invalid use of incomplete type ‘struct ve::ValueExpressionParser’
ValueExpressionDriver.H:18: error: forward declaration of ‘struct ve::ValueExpressionParser’
ValueExpressionParser.tab.cc:509: error: invalid use of incomplete type ‘struct ve::ValueExpressionParser’
ValueExpressionDriver.H:18: error: forward declaration of ‘struct ve::ValueExpressionParser’
ValueExpressionParser.tab.cc:549: error: invalid use of incomplete type ‘struct ve::ValueExpressionParser’
ValueExpressionDriver.H:18: error: forward declaration of ‘struct ve::ValueExpressionParser’
ValueExpressionParser.tab.cc:2137: error: invalid use of incomplete type ‘struct ve::ValueExpressionParser’
ValueExpressionDriver.H:18: error: forward declaration of ‘struct ve::ValueExpressionParser’
ValueExpressionParser.tab.cc:2187: error: invalid use of incomplete type ‘struct ve::ValueExpressionParser’
ValueExpressionDriver.H:18: error: forward declaration of ‘struct ve::ValueExpressionParser’
ValueExpressionParser.tab.cc:2189: error: invalid use of incomplete type ‘struct ve::ValueExpressionParser’
ValueExpressionDriver.H:18: error: forward declaration of ‘struct ve::ValueExpressionParser’
ValueExpressionParser.tab.cc:2259: error: invalid use of incomplete type ‘struct ve::ValueExpressionParser’
ValueExpressionDriver.H:18: error: forward declaration of ‘struct ve::ValueExpressionParser’
ValueExpressionParser.tab.cc:2327: error: invalid use of incomplete type ‘struct ve::ValueExpressionParser’
ValueExpressionDriver.H:18: error: forward declaration of ‘struct ve::ValueExpressionParser’
ValueExpressionParser.tab.cc:2335: error: invalid use of incomplete type ‘struct ve::ValueExpressionParser’
ValueExpressionDriver.H:18: error: forward declaration of ‘struct ve::ValueExpressionParser’
ValueExpressionParser.tab.cc:2344: error: invalid use of incomplete type ‘struct ve::ValueExpressionParser’
ValueExpressionDriver.H:18: error: forward declaration of ‘struct ve::ValueExpressionParser’
ValueExpressionParser.tab.cc:2346: error: invalid use of incomplete type ‘struct ve::ValueExpressionParser’
ValueExpressionDriver.H:18: error: forward declaration of ‘struct ve::ValueExpressionParser’
ValueExpressionParser.tab.cc:2587: error: invalid use of incomplete type ‘struct ve::ValueExpressionParser’
ValueExpressionDriver.H:18: error: forward declaration of ‘struct ve::ValueExpressionParser’
ValueExpressionParser.tab.cc:2829: error: invalid use of incomplete type ‘struct ve::ValueExpressionParser’
ValueExpressionDriver.H:18: error: forward declaration of ‘struct ve::ValueExpressionParser’
ValueExpressionParser.tab.cc:2917: error: invalid use of incomplete type ‘struct ve::ValueExpressionParser’
ValueExpressionDriver.H:18: error: forward declaration of ‘struct ve::ValueExpressionParser’
ValueExpressionParser.tab.cc:2942: error: invalid use of incomplete type ‘struct ve::ValueExpressionParser’
ValueExpressionDriver.H:18: error: forward declaration of ‘struct ve::ValueExpressionParser’
ValueExpressionParser.tab.cc:3170: error: ‘token_number_type’ in class ‘ve::ValueExpressionParser’ does not name a type
ValueExpressionParser.tab.cc:3220: error: invalid use of incomplete type ‘struct ve::ValueExpressionParser’
ValueExpressionDriver.H:18: error: forward declaration of ‘struct ve::ValueExpressionParser’
ValueExpressionParser.tab.cc:3221: error: invalid use of incomplete type ‘struct ve::ValueExpressionParser’
ValueExpressionDriver.H:18: error: forward declaration of ‘struct ve::ValueExpressionParser’
ValueExpressionParser.tab.cc:3222: error: invalid use of incomplete type ‘struct ve::ValueExpressionParser’
ValueExpressionDriver.H:18: error: forward declaration of ‘struct ve::ValueExpressionParser’
ValueExpressionParser.tab.cc:3223: error: invalid use of incomplete type ‘struct ve::ValueExpressionParser’
ValueExpressionDriver.H:18: error: forward declaration of ‘struct ve::ValueExpressionParser’
ValueExpressionParser.tab.cc:3224: error: invalid use of incomplete type ‘struct ve::ValueExpressionParser’
ValueExpressionDriver.H:18: error: forward declaration of ‘struct ve::ValueExpressionParser’
ValueExpressionParser.tab.cc:3225: error: invalid use of incomplete type ‘struct ve::ValueExpressionParser’
ValueExpressionDriver.H:18: error: forward declaration of ‘struct ve::ValueExpressionParser’
ValueExpressionParser.tab.cc:3226: error: invalid use of incomplete type ‘struct ve::ValueExpressionParser’
ValueExpressionDriver.H:18: error: forward declaration of ‘struct ve::ValueExpressionParser’
ValueExpressionParser.tab.cc:3227: error: invalid use of incomplete type ‘struct ve::ValueExpressionParser’
ValueExpressionDriver.H:18: error: forward declaration of ‘struct ve::ValueExpressionParser’
ValueExpressionParser.tab.cc:3229: error: invalid use of incomplete type ‘struct ve::ValueExpressionParser’
ValueExpressionDriver.H:18: error: forward declaration of ‘struct ve::ValueExpressionParser’
ValueExpressionParser.tab.cc:3230: error: ‘token_number_type’ in class ‘ve::ValueExpressionParser’ does not name a type
ValueExpressionParser.yy:384: error: expected unqualified-id before ‘&’ token
ValueExpressionParser.yy:384: error: expected ‘,’ or ‘...’ before ‘&’ token
ValueExpressionParser.yy:385: error: invalid use of incomplete type ‘struct ve::ValueExpressionParser’
ValueExpressionDriver.H:18: error: forward declaration of ‘struct ve::ValueExpressionParser’
make: *** [Make/linux64GccDPOpt/ValueExpressionParser.o] Error 1
igo is offline   Reply With Quote

Old   November 20, 2012, 21:16
Default
  #2
Assistant Moderator
 
Bernhard Gschaider
Join Date: Mar 2009
Posts: 3,912
Rep Power: 40
gschaider will become famous soon enoughgschaider will become famous soon enough
Quote:
Originally Posted by igo View Post
Hi everybody,
I'm trying to install funkySetFields but it's not working and I cannot figure out why. I don't install swak4foam because my version of bison is 2.3 which is not sufficient for swak and I cannot upgrade to a newer version. Anyway, the error message that I am getting follows. Any help would be greatly appreciated.
Don't know about the error you're seeing. But about not being able to upgrade bison: that is because you're living on a conservative enterprise Linux and there are no newer packages, right? One way to work around this would be to compile bison/flex for you locally. It is not that difficult as these two programs don't require much more than a C-compiler. Basically what you do is set for configure the option --prefix=/home/igo/mySoftware and then do the usual make, make install thing. Then add the directory with the compiled programs to the PATH (export PATH=/home/igo/mySoftware/bin:$PATH) and you should have your very own bison (this is not a recipe, just a pointer)
__________________
Note: I don't use "Friend"-feature on this forum out of principle. Ah. And by the way: I'm not on Facebook either. So don't be offended if I don't accept your invitation/friend request
gschaider is offline   Reply With Quote

Reply

Tags
funkysetfields, installation

Thread Tools
Display Modes

Posting Rules
You may not post new threads
You may not post replies
You may not post attachments
You may not edit your posts

BB code is On
Smilies are On
[IMG] code is On
HTML code is Off
Trackbacks are On
Pingbacks are On
Refbacks are On


Similar Threads
Thread Thread Starter Forum Replies Last Post
groovyBC and funkySetFields married and got a kid named swak4Foam gschaider OpenFOAM 164 January 13, 2015 03:52
funkySetFields and funkySetBoundaryFields zxj160 OpenFOAM 14 October 3, 2013 12:52
installing funkySetFields utility for OpenFOAM 1.4.1 ozie OpenFOAM 8 September 8, 2011 11:16
installing funkySetFields prapanj OpenFOAM Installation 61 July 5, 2011 11:35
My experience Installing Elmer (Open Source Multi physics programme) on Linux Ahmed Main CFD Forum 3 August 10, 2010 13:42


All times are GMT -4. The time now is 15:46.