CFD Online Logo CFD Online URL
www.cfd-online.com
[Sponsors]
Home > Forums > Software User Forums > OpenFOAM > OpenFOAM Installation

[OpenFOAM.org] collect2: error: ld returned 1 exit status

Register Blogs Members List Search Today's Posts Mark Forums Read

Reply
 
LinkBack Thread Tools Search this Thread Display Modes
Old   June 5, 2020, 13:13
Default collect2: error: ld returned 1 exit status
  #1
Senior Member
 
krishna kant
Join Date: Feb 2016
Location: Hyderabad, India
Posts: 107
Rep Power: 6
kk415 is on a distinguished road
make: *** [/opt/OpenFOAM/OpenFOAM-v1912/wmake/makefiles/general:143: /opt/OpenFOAM/OpenFOAM-v1912/platforms/linux64Gcc63DPInt32Opt/bin/interIsoFoamv1] Error 1

The above is the error I am getting after installing OpenFoam-v1912 on windows. Any help will be deeply appreciated.
kk415 is offline   Reply With Quote

Reply

Thread Tools Search this Thread
Search this Thread:

Advanced Search
Display Modes

Posting Rules
You may not post new threads
You may not post replies
You may not post attachments
You may not edit your posts

BB code is On
Smilies are On
[IMG] code is On
HTML code is Off
Trackbacks are Off
Pingbacks are On
Refbacks are On


Similar Threads
Thread Thread Starter Forum Replies Last Post
when running tutorial: Permission denied collect2: ld returned 1 exit status semaviso OpenFOAM Running, Solving & CFD 3 December 12, 2019 11:03
collect2: error: ld returned 1 exit status Zack OpenFOAM Programming & Development 12 August 29, 2018 16:22
[swak4Foam] Error bulding swak4Foam sfigato OpenFOAM Community Contributions 18 August 22, 2013 13:41
[swak4Foam] Installing swak4Foam to OpenFOAM in mac Kaquesang OpenFOAM Community Contributions 22 January 21, 2013 12:51
Errors running allwmake in OpenFOAM141dev with WM_COMPILE_OPTION%3ddebug unoder OpenFOAM Installation 11 January 30, 2008 21:30


All times are GMT -4. The time now is 01:30.